Target
Tyrosine-protein kinase Lck
Ligand
BDBM50120126
Substrate
Meas. Tech.
ChEMBL_468975 (CHEMBL952120)
IC50
9±n/a nM
Citation
 Kolb, PHuang, DDey, FCaflisch, A Discovery of kinase inhibitors by high-throughput docking and scoring based on a transferable linear interaction energy model. J Med Chem 51:1179-88 (2008)  
Target
Name:
Tyrosine-protein kinase Lck
Synonyms:
2.7.10.2 LCK_HUMAN Leukocyte C-terminal Src kinase Lymphocyte-specific protein tyrosine kinase Protein YT16 Proto-oncogene tyrosine-protein kinase LCK T cell-specific protein-tyrosine kinase
Type:
Mol. Mass.:
57987.83
Organism:
Homo sapiens (Human)
Description:
P06239
Residue:
509
  
Inhibitor
Name:
BDBM50120126
Synonyms:
(2-Chloro-6-methyl-phenyl)-[8-(4-methyl-[1,4]diazepan-1-yl)-imidazo[1,5-a]quinoxalin-4-yl]-amine N-(2-chloro-6-methylphenyl)-8-(4-methyl-1,4-diazepan-1-yl)imidazo[1,5-a]quinoxalin-4-amine
Type:
Small organic molecule
Emp. Form.:
C23H25ClN6
Mol. Mass.:
420.938
SMILES:
CN1CCCN(CC1)c1ccc2nc(Nc3c(C)cccc3Cl)c3cncn3c2c1
: