Target
Protein kinase C eta type
Ligand
BDBM50374190
Substrate
Meas. Tech.
ChEMBL_469041 (CHEMBL929993)
Ki
9.9±n/a nM
Citation
 Sugimoto, TItagaki, KIrie, K Design and physicochemical properties of new fluorescent ligands of protein kinase C isozymes focused on CH/pi interaction. Bioorg Med Chem 16:650-7 (2008)  
Target
Name:
Protein kinase C eta type
Synonyms:
KPCL_HUMAN PKCL PRKCL Protein kinase C, PKC; classical/novel | nPKC-eta
Type:
Enzyme
Mol. Mass.:
77844.26
Organism:
Homo sapiens (Human)
Description:
The recombinant human PKC enzymes were produced using a baculovirus expression system in SF9 cells
Residue:
683
  
Inhibitor
Name:
BDBM50374190
Synonyms:
CHEMBL271403
Type:
Small organic molecule
Emp. Form.:
C18H22N4O2
Mol. Mass.:
326.3929
SMILES:
CC(C)[C@@H]1N(C)c2ccc3cnn4cc(C[C@@H](CO)NC1=O)c2c34
: