Target
Prolyl endopeptidase
Ligand
BDBM50374388
Substrate
Meas. Tech.
ChEMBL_469247 (CHEMBL948947)
IC50
4±n/a nM
Citation
 Maryanoff, BECostanzo, MJ Inhibitors of proteases and amide hydrolases that employ an alpha-ketoheterocycle as a key enabling functionality. Bioorg Med Chem 16:1562-95 (2008)  
Target
Name:
Prolyl endopeptidase
Synonyms:
3.4.21.26 PPCE_PIG Post-proline cleaving enzyme
Type:
Mol. Mass.:
80758.04
Organism:
Sus scrofa
Description:
Residue:
710
  
Inhibitor
Name:
BDBM50374388
Synonyms:
CHEMBL256268
Type:
Small organic molecule
Emp. Form.:
C26H29N3O2S
Mol. Mass.:
447.592
SMILES:
O=C([C@@H]1CCCN1CCCc1ccccc1)N1CCC[C@H]1C(=O)c1nc2ccccc2s1
: