Target
Peroxisome proliferator-activated receptor delta
Ligand
BDBM50374787
Substrate
Meas. Tech.
ChEMBL_469929 (CHEMBL938398)
EC50
2±n/a nM
Citation
 Shen, LZhang, YWang, ASieber-McMaster, EChen, XPelton, PXu, JZYang, MZhu, PZhou, LReuman, MHu, ZRussell, RGibbs, ACRoss, HDemarest, KMurray, WVKuo, GH Synthesis and structure-activity relationships of thiadiazole-derivatives as potent and orally active peroxisome proliferator-activated receptors alpha/delta dual agonists. Bioorg Med Chem 16:3321-41 (2008)  
Target
Name:
Peroxisome proliferator-activated receptor delta
Synonyms:
NR1C2 NUCI Nuclear receptor subfamily 1 group C member 2 PPAR-beta PPARD Peroxisome proliferator-activated receptor Peroxisome proliferator-activated receptor delta
Type:
Enzyme
Mol. Mass.:
49910.45
Organism:
Homo sapiens (Human)
Description:
Q03181
Residue:
441
  
Inhibitor
Name:
BDBM50374787
Synonyms:
CHEMBL411045
Type:
Small organic molecule
Emp. Form.:
C22H21F3N2O3S2
Mol. Mass.:
482.539
SMILES:
Cc1cc(SCCc2nc(ns2)-c2ccc(cc2)C(F)(F)F)ccc1OC(C)(C)C(O)=O
: