Target
Mu-type opioid receptor
Ligand
BDBM50071370
Substrate
Meas. Tech.
ChEMBL_470450 (CHEMBL932676)
Ki
1125±n/a nM
Citation
 Ma, ZXu, WLiu-Chen, LYLee, DY Novel coumarin glycoside and phenethyl vanillate from Notopterygium forbesii and their binding affinities for opioid and dopamine receptors. Bioorg Med Chem 16:3218-23 (2008)  
Target
Name:
Mu-type opioid receptor
Synonyms:
MOR-1 Mu-type opioid receptor (MOR) OPRM_RAT Opioid receptor B Ror-b
Type:
G Protein-Coupled Receptor (GPCR)
Mol. Mass.:
44503.11
Organism:
Rattus norvegicus (rat)
Description:
Competition binding assays were carried out using membrane preparations from transfected HN9.10 cells that constitutively expressed the mu opioid receptor.
Residue:
398
  
Inhibitor
Name:
BDBM50071370
Synonyms:
(3R,8S)-falcarindiol (3S,8S)-falcarindiol (Z)-(3S,8S)-Heptadeca-1,9-diene-4,6-diyne-3,8-diol Falcarindiol Heptadeca-1,9-diene-4,6-diyne-3,8-diol
Type:
Small organic molecule
Emp. Form.:
C17H24O2
Mol. Mass.:
260.3713
SMILES:
CCCCCCC\C=C/[C@H](O)C#CC#C[C@H](O)C=C
: