Target
Delta-type opioid receptor
Ligand
BDBM50071370
Substrate
Meas. Tech.
ChEMBL_470452 (CHEMBL932679)
Ki
1096±n/a nM
Citation
 Ma, ZXu, WLiu-Chen, LYLee, DY Novel coumarin glycoside and phenethyl vanillate from Notopterygium forbesii and their binding affinities for opioid and dopamine receptors. Bioorg Med Chem 16:3218-23 (2008)  
Target
Name:
Delta-type opioid receptor
Synonyms:
DOR-1 MSL-2 OPRD_MOUSE Oprd1
Type:
Enzyme Catalytic Domain
Mol. Mass.:
40577.25
Organism:
MOUSE
Description:
P32300
Residue:
372
  
Inhibitor
Name:
BDBM50071370
Synonyms:
(3R,8S)-falcarindiol (3S,8S)-falcarindiol (Z)-(3S,8S)-Heptadeca-1,9-diene-4,6-diyne-3,8-diol Falcarindiol Heptadeca-1,9-diene-4,6-diyne-3,8-diol
Type:
Small organic molecule
Emp. Form.:
C17H24O2
Mol. Mass.:
260.3713
SMILES:
CCCCCCC\C=C/[C@H](O)C#CC#C[C@H](O)C=C
: