Target
Cruzipain
Ligand
BDBM50108841
Substrate
Meas. Tech.
ChEMBL_471525 (CHEMBL938460)
Ki
7.5±n/a nM
Citation
 Freitas, RFOprea, TIMontanari, CA 2D QSAR and similarity studies on cruzain inhibitors aimed at improving selectivity over cathepsin L. Bioorg Med Chem 16:838-53 (2008)  
Target
Name:
Cruzipain
Synonyms:
CYSP_TRYCR Cruzaine | Major cysteine proteinase
Type:
Protein
Mol. Mass.:
49831.41
Organism:
Trypanosoma cruzi
Description:
P25779
Residue:
467
  
Inhibitor
Name:
BDBM50108841
Synonyms:
CHEMBL161508 benzyl (S)-1-((S)-4-(cyclohexylthio)-3-oxo-1-phenylbutan-2-ylamino)-1-oxo-3-phenylpropan-2-ylcarbamate
Type:
Small organic molecule
Emp. Form.:
C33H38N2O4S
Mol. Mass.:
558.731
SMILES:
O=C(N[C@@H](Cc1ccccc1)C(=O)N[C@@H](Cc1ccccc1)C(=O)CSC1CCCCC1)OCc1ccccc1
: