Target
Cannabinoid receptor 2
Ligand
BDBM50375389
Substrate
Meas. Tech.
ChEMBL_471723 (CHEMBL920995)
IC50
46±n/a nM
Citation
 Ohta, HIshizaka, TTatsuzuki, MYoshinaga, MIida, IYamaguchi, TTomishima, YFutaki, NToda, YSaito, S Imine derivatives as new potent and selective CB2 cannabinoid receptor agonists with an analgesic action. Bioorg Med Chem 16:1111-24 (2008)  
Target
Name:
Cannabinoid receptor 2
Synonyms:
CANNABINOID CB2 CB2 CB2B CNR2_HUMAN Cannabinoid CB2 receptor Cannabinoid receptor 2 (CB2R) | hCB2
Type:
G Protein-Coupled Receptor (GPCR)
Mol. Mass.:
39690.94
Organism:
Homo sapiens (Human)
Description:
P34972
Residue:
360
  
Inhibitor
Name:
BDBM50375389
Synonyms:
CHEMBL401555
Type:
Small organic molecule
Emp. Form.:
C19H21F3N2O2
Mol. Mass.:
366.3774
SMILES:
CC(C)(C)c1c\c(=N/C(=O)c2cccc(c2)C(F)(F)F)n(CC2CC2)o1
: