Target
Cannabinoid receptor 1
Ligand
BDBM50375387
Substrate
Meas. Tech.
ChEMBL_471724 (CHEMBL920996)
IC50
2200±n/a nM
Citation
 Ohta, HIshizaka, TTatsuzuki, MYoshinaga, MIida, IYamaguchi, TTomishima, YFutaki, NToda, YSaito, S Imine derivatives as new potent and selective CB2 cannabinoid receptor agonists with an analgesic action. Bioorg Med Chem 16:1111-24 (2008)  
Target
Name:
Cannabinoid receptor 1
Synonyms:
CANN6 CB-R CNR CNR1_HUMAN Cannabinoid receptor Cannabinoid receptor 1 (brain)
Type:
G Protein-Coupled Receptor (GPCR)
Mol. Mass.:
52868.96
Organism:
Homo sapiens (Human)
Description:
P21554
Residue:
472
  
Inhibitor
Name:
BDBM50375387
Synonyms:
CHEMBL261031
Type:
Small organic molecule
Emp. Form.:
C20H23ClF3N3O
Mol. Mass.:
413.864
SMILES:
Cn1c(c\c(=N/C(=O)c2cccc(c2Cl)C(F)(F)F)n1CC1CC1)C(C)(C)C
: