Target
Proto-oncogene tyrosine-protein kinase Src
Ligand
BDBM50375665
Substrate
Meas. Tech.
ChEMBL_473604 (CHEMBL939372)
IC50
>400000000±n/a nM
Citation
 Fedorov, OMarsden, BPogacic, VRellos, PMüller, SBullock, ANSchwaller, JSundström, MKnapp, S A systematic interaction map of validated kinase inhibitors with Ser/Thr kinases. Proc Natl Acad Sci U S A 104:20523-8 (2007)  
Target
Name:
Proto-oncogene tyrosine-protein kinase Src
Synonyms:
Calmodulin/Proto-oncogene tyrosine-protein kinase Src Proto-oncogene c-Src SRC SRC_HUMAN V-src sarcoma (Schmidt-Ruppin A-2) viral oncogene homolog (avian) p60-Src | pp60c-src
Type:
Protein
Mol. Mass.:
59838.60
Organism:
Homo sapiens (Human)
Description:
P12931
Residue:
536
  
Inhibitor
Name:
BDBM50375665
Synonyms:
CHEMBL261238
Type:
Small organic molecule
Emp. Form.:
C21H14ClFN6
Mol. Mass.:
404.827
SMILES:
CN(c1cccnc1)c1cc2c(Nc3ccc(F)c(Cl)c3)c(cnc2cn1)C#N
: