Target
Thymidine kinase
Ligand
BDBM85707
Substrate
Meas. Tech.
ChEMBL_474153 (CHEMBL938411)
IC50
800000±n/a nM
Citation
 Focher, FLossani, AVerri, ASpadari, SMaioli, AGambino, JJWright, GEEberle, RBlack, DHMedveczky, PMedveczky, MShugar, D Sensitivity of monkey B virus (Cercopithecine herpesvirus 1) to antiviral drugs: role of thymidine kinase in antiviral activities of substrate analogs and acyclonucleosides. Antimicrob Agents Chemother 51:2028-34 (2007)  
Target
Name:
Thymidine kinase
Synonyms:
Type:
PROTEIN
Mol. Mass.:
40204.56
Organism:
Macacine herpesvirus 1
Description:
ChEMBL_474153
Residue:
370
  
Inhibitor
Name:
BDBM85707
Synonyms:
CAS_82410-32-0 NSC_3454
Type:
Small organic molecule
Emp. Form.:
C9H13N5O4
Mol. Mass.:
255.2306
SMILES:
Nc1nc2n(COC(CO)CO)cnc2c(=O)[nH]1
: