Target
Thymidine kinase
Ligand
BDBM50132292
Substrate
Meas. Tech.
ChEMBL_474153 (CHEMBL938411)
IC50
150±n/a nM
Citation
 Focher, FLossani, AVerri, ASpadari, SMaioli, AGambino, JJWright, GEEberle, RBlack, DHMedveczky, PMedveczky, MShugar, D Sensitivity of monkey B virus (Cercopithecine herpesvirus 1) to antiviral drugs: role of thymidine kinase in antiviral activities of substrate analogs and acyclonucleosides. Antimicrob Agents Chemother 51:2028-34 (2007)  
Target
Name:
Thymidine kinase
Synonyms:
Type:
PROTEIN
Mol. Mass.:
40204.56
Organism:
Macacine herpesvirus 1
Description:
ChEMBL_474153
Residue:
370
  
Inhibitor
Name:
BDBM50132292
Synonyms:
5-Ethyl-1-((2R,5R)-4-hydroxy-5-hydroxymethyl-tetrahydro-furan-2-yl)-1H-pyrimidine-2,4-dione 5-ethyl-2'-deoxyuridine Edoxudine cid_66377
Type:
Small organic molecule
Emp. Form.:
C11H16N2O5
Mol. Mass.:
256.2551
SMILES:
CCc1cn([C@H]2C[C@H](O)[C@@H](CO)O2)c(=O)[nH]c1=O
: