Target
Geranylgeranyl pyrophosphate synthase
Ligand
BDBM25284
Substrate
Meas. Tech.
ChEMBL_474168 (CHEMBL938426)
Ki
70±n/a nM
Citation
 Guo, RTCao, RLiang, PHKo, TPChang, THHudock, MPJeng, WYChen, CKZhang, YSong, YKuo, CJYin, FOldfield, EWang, AH Bisphosphonates target multiple sites in both cis- and trans-prenyltransferases. Proc Natl Acad Sci U S A 104:10022-7 (2007)  
Target
Name:
Geranylgeranyl pyrophosphate synthase
Synonyms:
Dimethylallyltranstransferase GGPP synthetase GGPPSase Geranylgeranyl Diphosphate Synthase (GGPPS) Geranylgeranyl pyrophosphate synthetase | Geranyltranstransferase
Type:
Homooctamer; transferase
Mol. Mass.:
34867.94
Organism:
Homo sapiens (Human)
Description:
Recombinant human GGPPS was cloned and expressed in E. coli.
Residue:
300
  
Inhibitor
Name:
BDBM25284
Synonyms:
(1-hydroxy-2-{3-[3-(naphthalene-2-sulfonamido)phenyl]phenyl}-1-phosphonoethyl)phosphonic acid bisphosphonate, 6
Type:
Small organic molecule
Emp. Form.:
C24H23NO9P2S
Mol. Mass.:
563.453
SMILES:
OC(Cc1cccc(c1)-c1cccc(NS(=O)(=O)c2ccc3ccccc3c2)c1)(P(O)(O)=O)P(O)(O)=O
: