Target
Cannabinoid receptor 1
Ligand
BDBM50375875
Substrate
Meas. Tech.
ChEMBL_474602 (CHEMBL921108)
Ki
2113±n/a nM
Citation
 Huffman, JWThompson, ALWiley, JLMartin, BR Synthesis and pharmacology of 1-deoxy analogs of CP-47,497 and CP-55,940. Bioorg Med Chem 16:322-35 (2008)  
Target
Name:
Cannabinoid receptor 1
Synonyms:
Brain-type cannabinoid receptor CB-R CNR1_RAT Cannabinoid receptor Cnr1 | Skr6
Type:
G Protein-Coupled Receptor (GPCR)
Mol. Mass.:
52856.55
Organism:
Rattus norvegicus (rat)
Description:
P20272
Residue:
473
  
Inhibitor
Name:
BDBM50375875
Synonyms:
CHEMBL263385 | JWH-403
Type:
Small organic molecule
Emp. Form.:
C20H32O
Mol. Mass.:
288.4675
SMILES:
CCCCCC(C)(C)c1ccc(cc1)[C@H]1CCC[C@@H](O)C1
: