Target
Gonadotropin-releasing hormone receptor
Ligand
BDBM50224310
Substrate
Meas. Tech.
ChEMBL_474609 (CHEMBL921115)
Ki
40±n/a nM
Citation
 Feher, MGao, YBaber, JCShirley, WASaunders, J The use of ligand-based de novo design for scaffold hopping and sidechain optimization: two case studies. Bioorg Med Chem 16:422-7 (2008)  
Target
Name:
Gonadotropin-releasing hormone receptor
Synonyms:
GNRHR GRHR GnRH-R Gonadotropin-releasing hormone receptor | Gonadotropin-releasing hormone receptor (GnRH)
Type:
Enzyme
Mol. Mass.:
37749.45
Organism:
Homo sapiens (Human)
Description:
P30968
Residue:
328
  
Inhibitor
Name:
BDBM50224310
Synonyms:
5-(3,5,5,8,8-pentamethyl-5,6,7,8-tetrahydro-naphthalen-2-ylmethyl)-furan-2-carboxylic acid (4-guanidinomethyl-cyclohexylmethyl)-amide | CHEMBL261145
Type:
Small organic molecule
Emp. Form.:
C30H44N4O2
Mol. Mass.:
492.696
SMILES:
Cc1cc2c(cc1Cc1ccc(o1)C(=O)NCC1CCC(CN=C(N)N)CC1)C(C)(C)CCC2(C)C
: