Target
Gonadotropin-releasing hormone receptor
Ligand
BDBM50375881
Substrate
Meas. Tech.
ChEMBL_474609 (CHEMBL921115)
Ki
0.7±n/a nM
Citation
 Feher, MGao, YBaber, JCShirley, WASaunders, J The use of ligand-based de novo design for scaffold hopping and sidechain optimization: two case studies. Bioorg Med Chem 16:422-7 (2008)  
Target
Name:
Gonadotropin-releasing hormone receptor
Synonyms:
GNRHR GRHR GnRH-R Gonadotropin-releasing hormone receptor | Gonadotropin-releasing hormone receptor (GnRH)
Type:
Enzyme
Mol. Mass.:
37749.45
Organism:
Homo sapiens (Human)
Description:
P30968
Residue:
328
  
Inhibitor
Name:
BDBM50375881
Synonyms:
CHEMBL408746
Type:
Small organic molecule
Emp. Form.:
C37H47N5O
Mol. Mass.:
577.802
SMILES:
CC(CNCCCCc1ccnnc1)c1c([nH]c2ccc(cc12)C(C)(C)C(=O)N1C2CCC1CC2)-c1cc(C)cc(C)c1
: