Target
Gonadotropin-releasing hormone receptor
Ligand
BDBM50116237
Substrate
Meas. Tech.
ChEMBL_474609 (CHEMBL921115)
Ki
47±n/a nM
Citation
 Feher, MGao, YBaber, JCShirley, WASaunders, J The use of ligand-based de novo design for scaffold hopping and sidechain optimization: two case studies. Bioorg Med Chem 16:422-7 (2008)  
Target
Name:
Gonadotropin-releasing hormone receptor
Synonyms:
GNRHR GRHR GnRH-R Gonadotropin-releasing hormone receptor | Gonadotropin-releasing hormone receptor (GnRH)
Type:
Enzyme
Mol. Mass.:
37749.45
Organism:
Homo sapiens (Human)
Description:
P30968
Residue:
328
  
Inhibitor
Name:
BDBM50116237
Synonyms:
6-Benzo[1,3]dioxol-5-yl-3-[(benzyl-methyl-amino)-methyl]-8-(2-fluoro-benzyl)-2-(4-methoxy-phenyl)-7-methyl-8H-imidazo[1,2-a]pyrimidin-5-one | CHEMBL306431
Type:
Small organic molecule
Emp. Form.:
C37H33FN4O4
Mol. Mass.:
616.6807
SMILES:
COc1ccc(cc1)-c1nc2n(Cc3ccccc3F)c(C)c(-c3ccc4OCOc4c3)c(=O)n2c1CN(C)Cc1ccccc1
: