Target
Gonadotropin-releasing hormone receptor
Ligand
BDBM50375887
Substrate
Meas. Tech.
ChEMBL_474609 (CHEMBL921115)
Ki
50±n/a nM
Citation
 Feher, MGao, YBaber, JCShirley, WASaunders, J The use of ligand-based de novo design for scaffold hopping and sidechain optimization: two case studies. Bioorg Med Chem 16:422-7 (2008)  
Target
Name:
Gonadotropin-releasing hormone receptor
Synonyms:
GNRHR GRHR GnRH-R Gonadotropin-releasing hormone receptor | Gonadotropin-releasing hormone receptor (GnRH)
Type:
Enzyme
Mol. Mass.:
37749.45
Organism:
Homo sapiens (Human)
Description:
P30968
Residue:
328
  
Inhibitor
Name:
BDBM50375887
Synonyms:
CHEMBL260552
Type:
Small organic molecule
Emp. Form.:
C32H34F2N4O2
Mol. Mass.:
544.6348
SMILES:
CNC(Cn1c(=O)c2CN(Cc3ccc(C)cc3C)CCc2n(Cc2c(F)cccc2F)c1=O)c1ccccc1
: