Target
Androgen receptor
Ligand
BDBM50346422
Substrate
Meas. Tech.
ChEMBL_475671 (CHEMBL937557)
Ki
3000±n/a nM
Citation
 Bisson, WHCheltsov, AVBruey-Sedano, NLin, BChen, JGoldberger, NMay, LTChristopoulos, ADalton, JTSexton, PMZhang, XKAbagyan, R Discovery of antiandrogen activity of nonsteroidal scaffolds of marketed drugs. Proc Natl Acad Sci U S A 104:11927-32 (2007)  
Target
Name:
Androgen receptor
Synonyms:
ANDR_RAT Ar Nr3c4 | androgen
Type:
Enzyme
Mol. Mass.:
98219.08
Organism:
Rattus norvegicus (Rat)
Description:
P15207
Residue:
902
  
Inhibitor
Name:
BDBM50346422
Synonyms:
10-(3-(4-hydroxypiperidin-1-yl)propyl)-10H-phenothiazine-2-carbonitrile PROPERICIAZINE | periciazine
Type:
Small organic molecule
Emp. Form.:
C21H23N3OS
Mol. Mass.:
365.492
SMILES:
OC1CCN(CCCN2c3ccccc3Sc3ccc(cc23)C#N)CC1
: