Target
Metabotropic glutamate receptor 2
Ligand
BDBM50376471
Substrate
Meas. Tech.
ChEMBL_476980 (CHEMBL937485)
IC50
7±n/a nM
Citation
 Woltering, TJWichmann, JGoetschi, EAdam, GKew, JNKnoflach, FBallard, TMHuwyler, JMutel, VGatti, S Synthesis and characterization of 1,3-dihydro-benzo[b][1,4]diazepin-2-one derivatives: Part 3. New potent non-competitive metabotropic glutamate receptor 2/3 antagonists. Bioorg Med Chem Lett 18:2725-9 (2008)  
Target
Name:
Metabotropic glutamate receptor 2
Synonyms:
GPRC1B GRM2_HUMAN Metabotropic glutamate receptor mGlu2 | metabotropic glutamate 2
Type:
Enzyme
Mol. Mass.:
95584.88
Organism:
Homo sapiens (Human)
Description:
Q14416
Residue:
872
  
Inhibitor
Name:
BDBM50376471
Synonyms:
CHEMBL408455
Type:
Small organic molecule
Emp. Form.:
C20H16F3N5O2
Mol. Mass.:
415.3685
SMILES:
CCOc1cc2N=C(CC(=O)Nc2cc1C(F)(F)F)c1cccc(c1)-n1ccnn1
: