Target
Mitogen-activated protein kinase 14
Ligand
BDBM50376646
Substrate
Meas. Tech.
ChEMBL_477675 (CHEMBL924741)
IC50
480±n/a nM
Citation
 Laufer, SAMargutti, S Isoxazolone based inhibitors of p38 MAP kinases. J Med Chem 51:2580-4 (2008)  
Target
Name:
Mitogen-activated protein kinase 14
Synonyms:
CSAID-binding protein CSBP1 CSPB1 MAP kinase 14 MAP kinase p38 alpha MAPK14 MK14_HUMAN Mitogen-activated protein kinase p38 alpha Stress-activated protein kinase 2a | p38 MAP kinase alpha/beta
Type:
Serine/threonine-protein kinase
Mol. Mass.:
41286.76
Organism:
Homo sapiens (Human)
Description:
Q16539
Residue:
360
  
Inhibitor
Name:
BDBM50376646
Synonyms:
CHEMBL408196
Type:
Small organic molecule
Emp. Form.:
C21H15FN2O4S
Mol. Mass.:
410.418
SMILES:
Cc1ccc(cc1)S(=O)(=O)n1oc(=O)c(c1-c1ccncc1)-c1ccc(F)cc1
: