Target
Mitogen-activated protein kinase 14
Ligand
BDBM50376651
Substrate
Meas. Tech.
ChEMBL_477675 (CHEMBL924741)
IC50
1320±n/a nM
Citation
 Laufer, SAMargutti, S Isoxazolone based inhibitors of p38 MAP kinases. J Med Chem 51:2580-4 (2008)  
Target
Name:
Mitogen-activated protein kinase 14
Synonyms:
CSAID-binding protein CSBP1 CSPB1 MAP kinase 14 MAP kinase p38 alpha MAPK14 MK14_HUMAN Mitogen-activated protein kinase p38 alpha Stress-activated protein kinase 2a | p38 MAP kinase alpha/beta
Type:
Serine/threonine-protein kinase
Mol. Mass.:
41286.76
Organism:
Homo sapiens (Human)
Description:
Q16539
Residue:
360
  
Inhibitor
Name:
BDBM50376651
Synonyms:
CHEMBL259637
Type:
Small organic molecule
Emp. Form.:
C18H17FN2O3
Mol. Mass.:
328.3376
SMILES:
CCOCCn1oc(=O)c(c1-c1ccncc1)-c1ccc(F)cc1
: