Target
Mitogen-activated protein kinase 14
Ligand
BDBM50376654
Substrate
Meas. Tech.
ChEMBL_477675 (CHEMBL924741)
IC50
2130±n/a nM
Citation
 Laufer, SAMargutti, S Isoxazolone based inhibitors of p38 MAP kinases. J Med Chem 51:2580-4 (2008)  
Target
Name:
Mitogen-activated protein kinase 14
Synonyms:
CSAID-binding protein CSBP1 CSPB1 MAP kinase 14 MAP kinase p38 alpha MAPK14 MK14_HUMAN Mitogen-activated protein kinase p38 alpha Stress-activated protein kinase 2a | p38 MAP kinase alpha/beta
Type:
Serine/threonine-protein kinase
Mol. Mass.:
41286.76
Organism:
Homo sapiens (Human)
Description:
Q16539
Residue:
360
  
Inhibitor
Name:
BDBM50376654
Synonyms:
CHEMBL264178
Type:
Small organic molecule
Emp. Form.:
C18H15FN2O2
Mol. Mass.:
310.3223
SMILES:
Fc1ccc(cc1)-c1c(-c2ccncc2)n(CC2CC2)oc1=O
: