Target
Prostaglandin G/H synthase 1
Ligand
BDBM50376858
Substrate
Meas. Tech.
ChEMBL_478522 (CHEMBL923484)
IC50
>100000±n/a nM
Citation
 Reddy, MVBilla, VKPallela, VRMallireddigari, MRBoominathan, RGabriel, JLReddy, EP Design, synthesis, and biological evaluation of 1-(4-sulfamylphenyl)-3-trifluoromethyl-5-indolyl pyrazolines as cyclooxygenase-2 (COX-2) and lipoxygenase (LOX) inhibitors. Bioorg Med Chem 16:3907-16 (2008)  
Target
Name:
Prostaglandin G/H synthase 1
Synonyms:
COX1 Cyclooxygenase-1 (COX-1) PTGS1 | Prostaglandin G/H synthase (cyclooxygenase)
Type:
Protein
Mol. Mass.:
68868.60
Organism:
Ovis aries (Sheep)
Description:
Residue:
600
  
Inhibitor
Name:
BDBM50376858
Synonyms:
CHEMBL265200
Type:
Small organic molecule
Emp. Form.:
C18H14F3N5O4S
Mol. Mass.:
453.395
SMILES:
NS(=O)(=O)c1ccc(cc1)N1N=C(CC1c1c[nH]c2ccc(cc12)[N+]([O-])=O)C(F)(F)F
: