Target
Adenosine receptor A2b
Ligand
BDBM50205580
Substrate
Meas. Tech.
ChEMBL_478884 (CHEMBL937355)
EC50
81283052±n/a nM
Citation
 Ivanov, AAWang, BKlutz, AMChen, VLGao, ZGJacobson, KA Probing distal regions of the A2B adenosine receptor by quantitative structure-activity relationship modeling of known and novel agonists. J Med Chem 51:2088-99 (2008)  
Target
Name:
Adenosine receptor A2b
Synonyms:
AA2BR_HUMAN ADORA2B Adenosine receptors A2b | Adenosine receptors; A2a & A2b
Type:
G Protein-Coupled Receptor (GPCR)
Mol. Mass.:
36341.22
Organism:
Homo sapiens (Human)
Description:
Residue:
332
  
Inhibitor
Name:
BDBM50205580
Synonyms:
(2S,3S,4R,5R)-5-(6-(4-(2-(4-chlorophenylamino)-2-oxoethoxy)phenylamino)-9H-purin-9-yl)-N-ethyl-3,4-dihydroxy-tetrahydrofuran-2-carboxamide CHEMBL437168
Type:
Small organic molecule
Emp. Form.:
C26H26ClN7O6
Mol. Mass.:
567.981
SMILES:
CCNC(=O)[C@H]1O[C@H]([C@H](O)[C@@H]1O)n1cnc2c(Nc3ccc(OCC(=O)Nc4ccc(Cl)cc4)cc3)ncnc12
: