Target
Dipeptidyl peptidase 4
Ligand
BDBM50376988
Substrate
Meas. Tech.
ChEMBL_479201 (CHEMBL925952)
IC50
4±n/a nM
Citation
 Eckhardt, MHauel, NHimmelsbach, FLangkopf, ENar, HMark, MTadayyon, MThomas, LGuth, BLotz, R 3,5-Dihydro-imidazo[4,5-d]pyridazin-4-ones: a class of potent DPP-4 inhibitors. Bioorg Med Chem Lett 18:3158-62 (2008)  
Target
Name:
Dipeptidyl peptidase 4
Synonyms:
ADABP Adenosine deaminase complexing protein 2 CD_antigen=CD26 DPP4 DPPIV Dipeptidyl peptidase 4 (DPP IV) Dipeptidyl peptidase 4 (DPP4) Dipeptidyl peptidase 4 membrane form Dipeptidyl peptidase IV Dipeptidyl peptidase IV (DDP-IV) Dipeptidyl peptidase IV membrane form Dipeptidyl peptidase-IV (DPP-4) T-cell activation antigen CD26 | TP103
Type:
Enzyme
Mol. Mass.:
88271.01
Organism:
Homo sapiens (Human)
Description:
P27487
Residue:
766
  
Inhibitor
Name:
BDBM50376988
Synonyms:
CHEMBL256969
Type:
Small organic molecule
Emp. Form.:
C22H23N7O2
Mol. Mass.:
417.4637
SMILES:
CC#CCn1c(nc2cnn(Cc3nc4ccccc4o3)c(=O)c12)N1CCCC(N)C1
: