Target
Macrophage colony-stimulating factor 1 receptor
Ligand
BDBM50377065
Substrate
Meas. Tech.
ChEMBL_479297 (CHEMBL933669)
IC50
54±n/a nM
Citation
 Meegalla, SKWall, MJChen, JWilson, KJBallentine, SKDesjarlais, RLSchubert, CCrysler, CSChen, YMolloy, CJChaikin, MAManthey, CLPlayer, MRTomczuk, BEIllig, CR Structure-based optimization of a potent class of arylamide FMS inhibitors. Bioorg Med Chem Lett 18:3632-7 (2008)  
Target
Name:
Macrophage colony-stimulating factor 1 receptor
Synonyms:
CSF1R FMS Macrophage colony stimulating factor receptor Macrophage colony-stimulating factor 1 receptor (c-FMS) Proto-oncogene c-Fms c-fms | cFMS
Type:
Protein
Mol. Mass.:
107979.48
Organism:
Homo sapiens (Human)
Description:
P07333
Residue:
972
  
Inhibitor
Name:
BDBM50377065
Synonyms:
CHEMBL408431
Type:
Small organic molecule
Emp. Form.:
C24H28N4O2
Mol. Mass.:
404.5047
SMILES:
CN1CCN(CC1)c1ccc(NC(=O)c2ccc(o2)C#N)c(c1)C1=C(C)CCCC1
: