Target
Carbonic anhydrase 2
Ligand
BDBM26196
Substrate
Meas. Tech.
ChEMBL_479318 (CHEMBL933690)
Ki
108±n/a nM
Citation
 Innocenti, AHilvo, MScozzafava, AParkkila, SSupuran, CT Carbonic anhydrase inhibitors: Inhibition of the new membrane-associated isoform XV with phenols. Bioorg Med Chem Lett 18:3593-6 (2008)  
Target
Name:
Carbonic anhydrase 2
Synonyms:
CA-II CAC Carbonate dehydratase II Carbonic anhydrase 2 (CA-II) Carbonic anhydrase C Carbonic anhydrase II (CA-II) Carbonic anhydrase II (hCA II) | Carbonic anhydrase isoenzyme II (hCA II)
Type:
Enzyme
Mol. Mass.:
29250.71
Organism:
Homo sapiens (Human)
Description:
P00918
Residue:
260
  
Inhibitor
Name:
BDBM26196
Synonyms:
4-cyanophenol phenol derivative, 10
Type:
Small organic molecule
Emp. Form.:
C7H5NO
Mol. Mass.:
119.1207
SMILES:
Oc1ccc(cc1)C#N
: