Target
Carbonic anhydrase 1
Ligand
BDBM50377337
Substrate
Meas. Tech.
ChEMBL_479524 (CHEMBL924879)
Ki
2070±n/a nM
Citation
 Cecchi, ACiani, LWinum, JYMontero, JLScozzafava, ARistori, SSupuran, CT Carbonic anhydrase inhibitors: design of spin-labeled sulfonamides incorporating TEMPO moieties as probes for cytosolic or transmembrane isozymes. Bioorg Med Chem Lett 18:3475-80 (2008)  
Target
Name:
Carbonic anhydrase 1
Synonyms:
CA-I CAB Carbonate dehydratase I Carbonic anhydrase 1 (CA I) Carbonic anhydrase 1 (Recombinant CA I) Carbonic anhydrase B Carbonic anhydrase I (CA I) Carbonic anhydrase I (CAI) Carbonic anhydrase isoenzyme I (hCA I) | hCA
Type:
Enzyme
Mol. Mass.:
28873.37
Organism:
Homo sapiens (Human)
Description:
P00915
Residue:
261
  
Inhibitor
Name:
BDBM50377337
Synonyms:
CHEMBL255710
Type:
Small organic molecule
Emp. Form.:
C16H25N4O3S2
Mol. Mass.:
385.525
SMILES:
CC1(C)CC(CC(C)(C)N1[O])NC(=S)Nc1cccc(c1)S(N)(=O)=O
: