Target
Adenosine receptor A2a
Ligand
BDBM50163014
Substrate
Meas. Tech.
ChEMBL_479903 (CHEMBL935756)
Ki
44700±n/a nM
Citation
 Melman, AGao, ZGKumar, DWan, TCGizewski, EAuchampach, JAJacobson, KA Design of (N)-methanocarba adenosine 5'-uronamides as species-independent A3 receptor-selective agonists. Bioorg Med Chem Lett 18:2813-9 (2008)  
Target
Name:
Adenosine receptor A2a
Synonyms:
AA2AR_MOUSE Adenosine receptor A2a | Adora2a
Type:
PROTEIN
Mol. Mass.:
44984.04
Organism:
Mus musculus
Description:
ChEMBL_479903
Residue:
410
  
Inhibitor
Name:
BDBM50163014
Synonyms:
(1S,2R,3S,4R,5S)-4-(6-(2,5-dimethoxybenzylamino)-2-chloro-9H-purin-9-yl)-2,3-dihydroxy-N-methylbicyclo[3.1.0]hexane-1-carboxamide CHEMBL178846
Type:
Small organic molecule
Emp. Form.:
C22H25ClN6O5
Mol. Mass.:
488.924
SMILES:
CNC(=O)[C@]12C[C@@H]1[C@H]([C@H](O)[C@@H]2O)n1cnc2c(NCc3cc(OC)ccc3OC)nc(Cl)nc12
: