Target
Adenosine receptor A1
Ligand
BDBM50377677
Substrate
Meas. Tech.
ChEMBL_479905 (CHEMBL935758)
Ki
482±n/a nM
Citation
 Melman, AGao, ZGKumar, DWan, TCGizewski, EAuchampach, JAJacobson, KA Design of (N)-methanocarba adenosine 5'-uronamides as species-independent A3 receptor-selective agonists. Bioorg Med Chem Lett 18:2813-9 (2008)  
Target
Name:
Adenosine receptor A1
Synonyms:
A1 adenosine receptor (hA1) AA1R_HUMAN ADORA1 Adenosine A1-receptor Adenosine receptor A1 (hA1) | Adenosine transporter (AdT)
Type:
G Protein-Coupled Receptor (GPCR)
Mol. Mass.:
36520.92
Organism:
Homo sapiens (Human)
Description:
P30542
Residue:
326
  
Inhibitor
Name:
BDBM50377677
Synonyms:
CHEMBL436649
Type:
Small organic molecule
Emp. Form.:
C27H29ClN6O5
Mol. Mass.:
553.009
SMILES:
CNC(=O)[C@@]12C[C@@H]1[C@H]([C@H](O)[C@@H]2O)n1cnc2c(NCc3cccc(Cl)c3)nc(nc12)C#CCCCC(=O)OC
: