Target
Adenosine receptor A1
Ligand
BDBM50118812
Substrate
Meas. Tech.
ChEMBL_479905 (CHEMBL935758)
Ki
49±n/a nM
Citation
 Melman, AGao, ZGKumar, DWan, TCGizewski, EAuchampach, JAJacobson, KA Design of (N)-methanocarba adenosine 5'-uronamides as species-independent A3 receptor-selective agonists. Bioorg Med Chem Lett 18:2813-9 (2008)  
Target
Name:
Adenosine receptor A1
Synonyms:
A1 adenosine receptor (hA1) AA1R_HUMAN ADORA1 Adenosine A1-receptor Adenosine receptor A1 (hA1) | Adenosine transporter (AdT)
Type:
G Protein-Coupled Receptor (GPCR)
Mol. Mass.:
36520.92
Organism:
Homo sapiens (Human)
Description:
P30542
Residue:
326
  
Inhibitor
Name:
BDBM50118812
Synonyms:
(2S,3S,4R,5R)-3,4-Dihydroxy-5-[6-(3-iodo-benzylamino)-purin-9-yl]-tetrahydro-furan-2-carboxylic acid methylamide (2S,3S,4R,5R)-5-(6-(3-iodobenzylamino)-9H-purin-9-yl)-3,4-dihydroxy-N-methyl-tetrahydrofuran-2-carboxamide (3S,4R,5R)-3,4-Dihydroxy-5-[6-(3-iodo-benzylamino)-purin-9-yl]-tetrahydro-furan-2-carboxylic acid methylamide 3,4-Dihydroxy-5-[6-(3-iodo-benzylamino)-purin-9-yl]-tetrahydro-furan-2-carboxylic acid methylamide IB-MECA | N6-(3-iodobenzyl)-5'-N-methylcarboxamidoadenosine
Type:
Small organic molecule
Emp. Form.:
C18H19IN6O4
Mol. Mass.:
510.2857
SMILES:
CNC(=O)[C@H]1O[C@H]([C@H](O)[C@@H]1O)n1cnc2c(NCc3cccc(I)c3)ncnc12
: