Target
Ryanodine receptor 1
Ligand
BDBM50292367
Substrate
Meas. Tech.
ChEMBL_503194 (CHEMBL990317)
EC50
13600±n/a nM
Citation
 Franklin, MAPenn, SGLebrilla, CBLam, THPessah, INMolinski, TF Bastadin 20 and bastadin O-sulfate esters from Ianthella basta: novel modulators of the Ry1R FKBP12 receptor complex. J Nat Prod 59:1121-7 (1997)  
Target
Name:
Ryanodine receptor 1
Synonyms:
RYR-1 RYR1_RABIT Skeletal muscle ryanodine receptor Type 1 ryanodine receptor
Type:
PROTEIN
Mol. Mass.:
565099.26
Organism:
Oryctolagus cuniculus
Description:
ChEMBL_19634
Residue:
5037
  
Inhibitor
Name:
BDBM50292367
Synonyms:
15,34-O-disulfatobastadin 7 | CHEMBL509326
Type:
Small organic molecule
Emp. Form.:
C34H24Br4N4O14S2
Mol. Mass.:
1096.32
SMILES:
[O-]S(=O)(=O)Oc1c(Br)cc2CCNC(=O)C(Cc3ccc(Oc4cc(CC(N=O)C(=O)NC=Cc5ccc(Oc1c2)c(Br)c5)cc(Br)c4OS([O-])(=O)=O)c(Br)c3)N=O
: