Target
5-hydroxytryptamine receptor 2A
Ligand
BDBM50194429
Substrate
Meas. Tech.
ChEMBL_550859 (CHEMBL1007658)
Ki
250000±n/a nM
Citation
 Weber, JTO'Connor, MFHayataka, KColson, NMedora, RRusso, EBParker, KK Activity of Parthenolide at 5HT2A receptors. J Nat Prod 60:651-3 (1997)  
Target
Name:
5-hydroxytryptamine receptor 2A
Synonyms:
5-HT-2A 5-HT2A 5-hydroxytryptamine receptor 2A (5HT2A) Htr2 Serotonin Receptor 2A
Type:
G Protein-Coupled Receptor (GPCR)
Mol. Mass.:
52852.05
Organism:
Rattus norvegicus (rat)
Description:
Rat cortex membranes 5-HT2A receptors.
Residue:
471
  
Inhibitor
Name:
BDBM50194429
Synonyms:
(-)-parthenolide (Z)-(1S,2S,4R,11S)-4,8-Dimethyl-12-methylene-3,14-dioxa-tricyclo[9.3.0.0*2,4*]tetradec-7-en-13-one PARTHENOLIDE
Type:
Small organic molecule
Emp. Form.:
C15H20O3
Mol. Mass.:
248.3175
SMILES:
C\C1=C\CC[C@@]2(C)O[C@H]2[C@H]2OC(=O)C(=C)[C@@H]2CC1
: