Target
Polyunsaturated fatty acid lipoxygenase ALOX15
Ligand
BDBM50206259
Substrate
Meas. Tech.
ChEMBL_502461 (CHEMBL986634)
IC50
500±n/a nM
Citation
 Amagata, TWhitman, SJohnson, TAStessman, CCLoo, CPLobkovsky, EClardy, JCrews, PHolman, TR Exploring sponge-derived terpenoids for their potency and selectivity against 12-human, 15-human, and 15-soybean lipoxygenases. J Nat Prod 66:230-5 (2003)  
Target
Name:
Polyunsaturated fatty acid lipoxygenase ALOX15
Synonyms:
15-Lipoxygenase-1 (15-LOX-1) Arachidonate 15-lipoxygenase LOG15 Reticulocyte 15-lipoxygenase-1 | Sphingosine 1-phosphate receptor 1 (S1P1)
Type:
Protein
Mol. Mass.:
74804.05
Organism:
Homo sapiens (Human)
Description:
Residue:
662
  
Inhibitor
Name:
BDBM50206259
Synonyms:
CHEMBL230058 | hydrohalisulfate 1
Type:
Small organic molecule
Emp. Form.:
C31H48O3
Mol. Mass.:
468.711
SMILES:
C[C@H](CCC\C(C)=C\Cc1cc(O)ccc1O)[C@H](O)C[C@H]1C(C)=CC[C@H]2C(C)(C)CCC[C@]12C
: