Target
Polyunsaturated fatty acid lipoxygenase ALOX15
Ligand
BDBM50242010
Substrate
Meas. Tech.
ChEMBL_502461 (CHEMBL986634)
IC50
1700±n/a nM
Citation
 Amagata, TWhitman, SJohnson, TAStessman, CCLoo, CPLobkovsky, EClardy, JCrews, PHolman, TR Exploring sponge-derived terpenoids for their potency and selectivity against 12-human, 15-human, and 15-soybean lipoxygenases. J Nat Prod 66:230-5 (2003)  
Target
Name:
Polyunsaturated fatty acid lipoxygenase ALOX15
Synonyms:
15-Lipoxygenase-1 (15-LOX-1) Arachidonate 15-lipoxygenase LOG15 Reticulocyte 15-lipoxygenase-1 | Sphingosine 1-phosphate receptor 1 (S1P1)
Type:
Protein
Mol. Mass.:
74804.05
Organism:
Homo sapiens (Human)
Description:
Residue:
662
  
Inhibitor
Name:
BDBM50242010
Synonyms:
(+)-(5S,8S,9R,10S)-20-methoxypuupehenone | CHEMBL463805
Type:
Small organic molecule
Emp. Form.:
C22H30O3
Mol. Mass.:
342.4718
SMILES:
COC1=CC2=C[C@H]3[C@](C)(CC[C@H]4C(C)(C)CCC[C@]34C)OC2=CC1=O
: