Target
Polyunsaturated fatty acid lipoxygenase ALOX15
Ligand
BDBM50269748
Substrate
Meas. Tech.
ChEMBL_502461 (CHEMBL986634)
IC50
830±n/a nM
Citation
 Amagata, TWhitman, SJohnson, TAStessman, CCLoo, CPLobkovsky, EClardy, JCrews, PHolman, TR Exploring sponge-derived terpenoids for their potency and selectivity against 12-human, 15-human, and 15-soybean lipoxygenases. J Nat Prod 66:230-5 (2003)  
Target
Name:
Polyunsaturated fatty acid lipoxygenase ALOX15
Synonyms:
15-Lipoxygenase-1 (15-LOX-1) Arachidonate 15-lipoxygenase LOG15 Reticulocyte 15-lipoxygenase-1 | Sphingosine 1-phosphate receptor 1 (S1P1)
Type:
Protein
Mol. Mass.:
74804.05
Organism:
Homo sapiens (Human)
Description:
Residue:
662
  
Inhibitor
Name:
BDBM50269748
Synonyms:
21-chloro-puupehenone chloropuupehenone
Type:
Small organic molecule
Emp. Form.:
C21H27ClO3
Mol. Mass.:
362.89
SMILES:
CC1(C)CCC[C@@]2(C)[C@H]1CC[C@]1(C)OC3=CC(=O)C(=O)C(Cl)C3=C[C@H]21
: