Target
Polyunsaturated fatty acid lipoxygenase ALOX12
Ligand
BDBM50065997
Substrate
Meas. Tech.
ChEMBL_502462 (CHEMBL986635)
IC50
3100±n/a nM
Citation
 Amagata, TWhitman, SJohnson, TAStessman, CCLoo, CPLobkovsky, EClardy, JCrews, PHolman, TR Exploring sponge-derived terpenoids for their potency and selectivity against 12-human, 15-human, and 15-soybean lipoxygenases. J Nat Prod 66:230-5 (2003)  
Target
Name:
Polyunsaturated fatty acid lipoxygenase ALOX12
Synonyms:
12-LOX 12LO Arachidonate 12-lipoxygenase LOG12 Platelet 12-lipoxygenase | Platelet-type lipoxygenase 12
Type:
Protein
Mol. Mass.:
75689.18
Organism:
Homo sapiens (Human)
Description:
P18054
Residue:
663
  
Inhibitor
Name:
BDBM50065997
Synonyms:
5-[4-(3-hydroxy-4-methoxyphenyl)-2,3-dimethyl-(2R,3S)-butyl]-2-methoxyphenol dimethylnordihydroguarierate acid
Type:
Small organic molecule
Emp. Form.:
C20H26O4
Mol. Mass.:
330.418
SMILES:
COc1ccc(C[C@H](C)[C@H](C)Cc2ccc(OC)c(O)c2)cc1O
: