Target
Polyunsaturated fatty acid lipoxygenase ALOX12
Ligand
BDBM50269775
Substrate
Meas. Tech.
ChEMBL_502462 (CHEMBL986635)
IC50
>200000±n/a nM
Citation
 Amagata, TWhitman, SJohnson, TAStessman, CCLoo, CPLobkovsky, EClardy, JCrews, PHolman, TR Exploring sponge-derived terpenoids for their potency and selectivity against 12-human, 15-human, and 15-soybean lipoxygenases. J Nat Prod 66:230-5 (2003)  
Target
Name:
Polyunsaturated fatty acid lipoxygenase ALOX12
Synonyms:
12-LOX 12LO Arachidonate 12-lipoxygenase LOG12 Platelet 12-lipoxygenase | Platelet-type lipoxygenase 12
Type:
Protein
Mol. Mass.:
75689.18
Organism:
Homo sapiens (Human)
Description:
P18054
Residue:
663
  
Inhibitor
Name:
BDBM50269775
Synonyms:
CHEMBL455880 halenaquinol sulfate sodium
Type:
Small organic molecule
Emp. Form.:
C20H13O8S
Mol. Mass.:
413.378
SMILES:
C[C@@]12CCC(=O)c3coc(c13)C(=O)c1cc3c(O)ccc(OS([O-])(=O)=O)c3cc21
: