Target
Neutrophil elastase
Ligand
BDBM50270039
Substrate
Meas. Tech.
ChEMBL_508157 (CHEMBL1008215)
IC50
>50000±n/a nM
Citation
 Méthot, NRubin, JGuay, DBeaulieu, CEthier, DReddy, TJRiendeau, DPercival, MD Inhibition of the activation of multiple serine proteases with a cathepsin C inhibitor requires sustained exposure to prevent pro-enzyme processing. J Biol Chem 282:20836-46 (2007)  
Target
Name:
Neutrophil elastase
Synonyms:
ELNE_MOUSE Elane
Type:
PROTEIN
Mol. Mass.:
28661.19
Organism:
Mus musculus
Description:
ChEMBL_1463437
Residue:
265
  
Inhibitor
Name:
BDBM50270039
Synonyms:
(S)-1-((1S,2S)-1-cyano-2-phenylcyclopropylamino)-1-oxo-3-(thiophen-2-yl)propan-2-aminium 2,2,2-trifluoroacetate | CHEMBL478737
Type:
Small organic molecule
Emp. Form.:
C17H18N3OS
Mol. Mass.:
312.409
SMILES:
[NH3+][C@H](Cc1cccs1)C(=O)N[C@]1(C[C@H]1c1ccccc1)C#N
: