Target
Procathepsin L
Ligand
BDBM19492
Substrate
Meas. Tech.
ChEMBL_508134 (CHEMBL1004871)
IC50
430±n/a nM
Citation
 Méthot, NRubin, JGuay, DBeaulieu, CEthier, DReddy, TJRiendeau, DPercival, MD Inhibition of the activation of multiple serine proteases with a cathepsin C inhibitor requires sustained exposure to prevent pro-enzyme processing. J Biol Chem 282:20836-46 (2007)  
Target
Name:
Procathepsin L
Synonyms:
CATL1_HUMAN CTSL CTSL1 Cathepsin L Cathepsin L1 heavy chain MEP cathepsin L preproprotein
Type:
Enzyme
Mol. Mass.:
37557.19
Organism:
Homo sapiens (Human)
Description:
Purchased from Calbiochem (San Diego, CA).
Residue:
333
  
Inhibitor
Name:
BDBM19492
Synonyms:
(2R)-2-{[(1S)-1-(4-bromophenyl)-2,2,2-trifluoroethyl]amino}-N-(1-cyanocyclopropyl)-3-methanesulfonylpropanamide trifluoroethylamine inhibitor, 2
Type:
Small organic molecule
Emp. Form.:
C16H17BrF3N3O3S
Mol. Mass.:
468.289
SMILES:
CS(=O)(=O)C[C@H](N[C@@H](c1ccc(Br)cc1)C(F)(F)F)C(=O)NC1(CC1)C#N
: