Target
Glutamate receptor ionotropic, kainate 1
Ligand
BDBM50251894
Substrate
Meas. Tech.
ChEMBL_487942 (CHEMBL1013073)
Ki
37200±n/a nM
Citation
 Sagot, EJensen, AAPickering, DSPu, XUmberti, MStensbøl, TBNielsen, BAssaf, ZAboab, BBolte, JGefflaut, TBunch, L Chemo-enzymatic synthesis of (2S,4R)-2-amino-4-(3-(2,2-diphenylethylamino)-3-oxopropyl)pentanedioic acid: a novel selective inhibitor of human excitatory amino acid transporter subtype 2. J Med Chem 51:4085-92 (2008)  
Target
Name:
Glutamate receptor ionotropic, kainate 1
Synonyms:
GRIK1_RAT Glutamate receptor ionotropic kainate 1 Glutamate receptor, ionotropic kainate 1 Grik1
Type:
Enzyme Catalytic Domain
Mol. Mass.:
107860.82
Organism:
RAT
Description:
P22756
Residue:
949
  
Inhibitor
Name:
BDBM50251894
Synonyms:
(2S,4R)-4-(2,2-Diphenylethylamino-3-oxopropyl)glutamic acid | CHEMBL480169
Type:
Small organic molecule
Emp. Form.:
C22H26N2O5
Mol. Mass.:
398.4522
SMILES:
N[C@@H](C[C@@H](CCC(=O)NCC(c1ccccc1)c1ccccc1)C(O)=O)C(O)=O
: