Target
Excitatory amino acid transporter 1
Ligand
BDBM50251894
Substrate
Meas. Tech.
ChEMBL_487931 (CHEMBL1016585)
IC50
1000000±n/a nM
Citation
 Sagot, EJensen, AAPickering, DSPu, XUmberti, MStensbøl, TBNielsen, BAssaf, ZAboab, BBolte, JGefflaut, TBunch, L Chemo-enzymatic synthesis of (2S,4R)-2-amino-4-(3-(2,2-diphenylethylamino)-3-oxopropyl)pentanedioic acid: a novel selective inhibitor of human excitatory amino acid transporter subtype 2. J Med Chem 51:4085-92 (2008)  
Target
Name:
Excitatory amino acid transporter 1
Synonyms:
EAA1_HUMAN Excitatory Amino Acid EAAT1 GLAST1 | SLC1A3
Type:
Enzyme Catalytic Domain
Mol. Mass.:
59577.19
Organism:
Homo sapiens (Human)
Description:
Excitatory Amino Acid EAAT1 0 HUMAN::P43003
Residue:
542
  
Inhibitor
Name:
BDBM50251894
Synonyms:
(2S,4R)-4-(2,2-Diphenylethylamino-3-oxopropyl)glutamic acid | CHEMBL480169
Type:
Small organic molecule
Emp. Form.:
C22H26N2O5
Mol. Mass.:
398.4522
SMILES:
N[C@@H](C[C@@H](CCC(=O)NCC(c1ccccc1)c1ccccc1)C(O)=O)C(O)=O
: