Target
Excitatory amino acid transporter 3
Ligand
BDBM50251894
Substrate
Meas. Tech.
ChEMBL_487935 (CHEMBL1016589)
IC50
1000000±n/a nM
Citation
 Sagot, EJensen, AAPickering, DSPu, XUmberti, MStensbøl, TBNielsen, BAssaf, ZAboab, BBolte, JGefflaut, TBunch, L Chemo-enzymatic synthesis of (2S,4R)-2-amino-4-(3-(2,2-diphenylethylamino)-3-oxopropyl)pentanedioic acid: a novel selective inhibitor of human excitatory amino acid transporter subtype 2. J Med Chem 51:4085-92 (2008)  
Target
Name:
Excitatory amino acid transporter 3
Synonyms:
EAA3_HUMAN EAAT3 HEAAC1 | SLC1A1
Type:
Enzyme Catalytic Domain
Mol. Mass.:
57096.71
Organism:
Homo sapiens (Human)
Description:
Excitatory Amino Acid EAAT3 0 HUMAN::P43005
Residue:
524
  
Inhibitor
Name:
BDBM50251894
Synonyms:
(2S,4R)-4-(2,2-Diphenylethylamino-3-oxopropyl)glutamic acid | CHEMBL480169
Type:
Small organic molecule
Emp. Form.:
C22H26N2O5
Mol. Mass.:
398.4522
SMILES:
N[C@@H](C[C@@H](CCC(=O)NCC(c1ccccc1)c1ccccc1)C(O)=O)C(O)=O
: