Target
Trifunctional purine biosynthetic protein adenosine-3
Ligand
BDBM50005518
Substrate
Meas. Tech.
ChEMBL_510466 (CHEMBL1006407)
IC50
780±n/a nM
Citation
 Deng, YWang, YCherian, CHou, ZBuck, SAMatherly, LHGangjee, A Synthesis and discovery of high affinity folate receptor-specific glycinamide ribonucleotide formyltransferase inhibitors with antitumor activity. J Med Chem 51:5052-63 (2008)  
Target
Name:
Trifunctional purine biosynthetic protein adenosine-3
Synonyms:
GAR transformylase PUR2_MOUSE
Type:
PROTEIN
Mol. Mass.:
107504.27
Organism:
Mus musculus
Description:
ChEMBL_497843
Residue:
1010
  
Inhibitor
Name:
BDBM50005518
Synonyms:
(S)-2-(4-(2-((R)-2-amino-4-oxo-1,4,5,6,7,8-hexahydropyrido[2,3-d]pyrimidin-6-yl)ethyl)benzamido)pentanedioic acid (S)-2-{(R)-4-[2-((R)-2-Amino-4-oxo-3,4,5,6,7,8-hexahydro-pyrido[2,3-d]pyrimidin-6-yl)-ethyl]-benzoylamino}-pentanedioic acid (S)-2-{(S)-4-[2-(2-Amino-4-hydroxy-5,6,7,8-tetrahydro-pyrido[2,3-d]pyrimidin-6-yl)-ethyl]-benzoylamino}-pentanedioic acid (S)-2-{4-[2-(2-Amino-4-oxo-3,4,5,6,7,8-hexahydro-pyrido[2,3-d]pyrimidin-6-yl)-ethyl]-benzoylamino}-pentanedioic acid CHEMBL142806 | LOMETREXOL
Type:
Small organic molecule
Emp. Form.:
C21H25N5O6
Mol. Mass.:
443.4531
SMILES:
Nc1nc2NCC(CCc3ccc(cc3)C(=O)N[C@@H](CCC(O)=O)C(O)=O)Cc2c(=O)[nH]1
: