Target
Trifunctional purine biosynthetic protein adenosine-3
Ligand
BDBM50272272
Substrate
Meas. Tech.
ChEMBL_510466 (CHEMBL1006407)
IC50
2260±n/a nM
Citation
 Deng, YWang, YCherian, CHou, ZBuck, SAMatherly, LHGangjee, A Synthesis and discovery of high affinity folate receptor-specific glycinamide ribonucleotide formyltransferase inhibitors with antitumor activity. J Med Chem 51:5052-63 (2008)  
Target
Name:
Trifunctional purine biosynthetic protein adenosine-3
Synonyms:
GAR transformylase PUR2_MOUSE
Type:
PROTEIN
Mol. Mass.:
107504.27
Organism:
Mus musculus
Description:
ChEMBL_497843
Residue:
1010
  
Inhibitor
Name:
BDBM50272272
Synonyms:
CHEMBL502528 | N-{4-[5-(2-Amino-4-oxo-4,7-dihydro-3H-pyrrolo[2,3-d]pyrimidin-6-yl)pentyl]benzoyl}-L-glutamic Acid
Type:
Small organic molecule
Emp. Form.:
C23H27N5O6
Mol. Mass.:
469.4904
SMILES:
Nc1nc2[nH]c(CCCCCc3ccc(cc3)C(=O)N[C@@H](CCC(O)=O)C(O)=O)cc2c(=O)[nH]1
: