Target
Trifunctional purine biosynthetic protein adenosine-3
Ligand
BDBM50171513
Substrate
Meas. Tech.
ChEMBL_510467 (CHEMBL1006408)
IC50
18±n/a nM
Citation
 Deng, YWang, YCherian, CHou, ZBuck, SAMatherly, LHGangjee, A Synthesis and discovery of high affinity folate receptor-specific glycinamide ribonucleotide formyltransferase inhibitors with antitumor activity. J Med Chem 51:5052-63 (2008)  
Target
Name:
Trifunctional purine biosynthetic protein adenosine-3
Synonyms:
GAR Tfase GART Glycinamide ribonucleotide transformylase (GAR Tfase) PRGS Thymidylate synthase/GAR transformylase/AICAR transformylase
Type:
Protein
Mol. Mass.:
107768.47
Organism:
Homo sapiens (Human)
Description:
P22102
Residue:
1010
  
Inhibitor
Name:
BDBM50171513
Synonyms:
(S)-2-(4-(3-(2-amino-4-oxo-4,7-dihydro-3H-pyrrolo[2,3-d]pyrimidin-6-yl)propyl)benzamido)pentanedioic acid CHEMBL192632
Type:
Small organic molecule
Emp. Form.:
C21H23N5O6
Mol. Mass.:
441.4372
SMILES:
Nc1nc2[nH]c(CCCc3ccc(cc3)C(=O)N[C@@H](CCC(O)=O)C(O)=O)cc2c(=O)[nH]1
: