Target
Fatty acid-binding protein, liver
Ligand
BDBM50150484
Substrate
Meas. Tech.
ChEMBL_555400 (CHEMBL964797)
Kd
900±n/a nM
Citation
 Chuang, SVelkov, THorne, JPorter, CJScanlon, MJ Characterization of the drug binding specificity of rat liver fatty acid binding protein. J Med Chem 51:3755-64 (2008)  
Target
Name:
Fatty acid-binding protein, liver
Synonyms:
FABP1 FABPL_HUMAN Liver fatty acid binding protein (human L-FABP T94T)
Type:
Protein
Mol. Mass.:
14208.72
Organism:
Homo sapiens (Human)
Description:
human L-FABP
Residue:
127
  
Inhibitor
Name:
BDBM50150484
Synonyms:
(Z)-9-octadecenoic acid CHEMBL8659 Octadec-9-enoic acid oleicacid
Type:
Small organic molecule
Emp. Form.:
C18H34O2
Mol. Mass.:
282.4614
SMILES:
CCCCCCCC\C=C/CCCCCCCC(O)=O
: