Target
Gamma-aminobutyric acid receptor subunit alpha-5
Ligand
BDBM50244227
Substrate
Meas. Tech.
ChEMBL_491119 (CHEMBL991887)
Ki
0.65±n/a nM
Citation
 Harris, DClayton, TCook, JSahbaie, PHalliwell, RFFurtmüller, RHuck, SSieghart, WDeLorey, TM Selective influence on contextual memory: physiochemical properties associated with selectivity of benzodiazepine ligands at GABAA receptors containing the alpha5 subunit. J Med Chem 51:3788-803 (2008)  
Target
Name:
Gamma-aminobutyric acid receptor subunit alpha-5
Synonyms:
GABA receptor alpha-5 subunit GABRA5 Gamma-aminobutyric acid receptor subunit alpha-5 (GABA(A)) | Gamma-aminobutyric acid receptor subunit alpha-5 (GABAA)
Type:
Enzyme
Mol. Mass.:
52160.59
Organism:
Homo sapiens (Human)
Description:
P31644
Residue:
462
  
Inhibitor
Name:
BDBM50244227
Synonyms:
CHEMBL458147 | tert-butyl 7-chloro-4-methyl-5-oxo-4,5-dihydroimidazo[1,5-a]quinazoline-3-carboxylate
Type:
Small organic molecule
Emp. Form.:
C16H16ClN3O3
Mol. Mass.:
333.77
SMILES:
Cn1c2c(ncn2c2ccc(Cl)cc2c1=O)C(=O)OC(C)(C)C
: