Target
Gamma-aminobutyric acid receptor subunit alpha-5
Ligand
BDBM50244261
Substrate
Meas. Tech.
ChEMBL_491432 (CHEMBL948527)
Ki
2.61±n/a nM
Citation
 Harris, DClayton, TCook, JSahbaie, PHalliwell, RFFurtmüller, RHuck, SSieghart, WDeLorey, TM Selective influence on contextual memory: physiochemical properties associated with selectivity of benzodiazepine ligands at GABAA receptors containing the alpha5 subunit. J Med Chem 51:3788-803 (2008)  
Target
Name:
Gamma-aminobutyric acid receptor subunit alpha-5
Synonyms:
GABA receptor alpha-5 subunit GABRA5 Gamma-aminobutyric acid receptor subunit alpha-5 (GABA(A)) | Gamma-aminobutyric acid receptor subunit alpha-5 (GABAA)
Type:
Enzyme
Mol. Mass.:
52160.59
Organism:
Homo sapiens (Human)
Description:
P31644
Residue:
462
  
Inhibitor
Name:
BDBM50244261
Synonyms:
5-Methyl-6-oxo-8-trimethylsilanylethynyl-3a,4,5,6-tetrahydro-1H-2,5,10b-triaza-benzo[e]azulene-3-carboxylic acid tert-butyl ester | CHEMBL471977
Type:
Small organic molecule
Emp. Form.:
C22H29N3O3Si
Mol. Mass.:
411.5695
SMILES:
CN1CC2N(CN=C2C(=O)OC(C)(C)C)c2ccc(cc2C1=O)C#C[Si](C)(C)C
: